Target
Nucleotide-binding oligomerization domain-containing protein 1
Ligand
BDBM54250
Substrate
Meas. Tech.
uHTS luminescence assay for the identification of compounds that inhibit NOD1
EC50
20000±n/a nM
Citation
 PubChem, PC uHTS luminescence assay for the identification of compounds that inhibit NOD1 PubChem Bioassay (2010)[AID] 
Target
Name:
Nucleotide-binding oligomerization domain-containing protein 1
Synonyms:
CARD4 NOD1_HUMAN | nucleotide-binding oligomerization domain containing 1
Type:
Enzyme Catalytic Domain
Mol. Mass.:
107699.03
Organism:
Homo sapiens (Human)
Description:
gi_5174617
Residue:
953
  
Inhibitor
Name:
BDBM54250
Synonyms:
(E)-1-(2,4-Dichloro-phenyl)-5-methyl-2-[1,2,4]triazol-1-yl-hex-1-en-3-one (E)-1-(2,4-dichlorophenyl)-5-methyl-2-(1,2,4-triazol-1-yl)hex-1-en-3-one SMR000221762 | cid_6510725
Type:
Small organic molecule
Emp. Form.:
C15H15Cl2N3O
Mol. Mass.:
324.205
SMILES:
CC(C)CC(=O)C(=Cc1ccc(Cl)cc1Cl)n1cncn1
: