Target
Nucleotide-binding oligomerization domain-containing protein 1
Ligand
BDBM59522
Substrate
Meas. Tech.
uHTS luminescence assay for the identification of compounds that inhibit NOD1
EC50
5500±n/a nM
Citation
 PubChem, PC uHTS luminescence assay for the identification of compounds that inhibit NOD1 PubChem Bioassay (2010)[AID] 
Target
Name:
Nucleotide-binding oligomerization domain-containing protein 1
Synonyms:
CARD4 NOD1_HUMAN | nucleotide-binding oligomerization domain containing 1
Type:
Enzyme Catalytic Domain
Mol. Mass.:
107699.03
Organism:
Homo sapiens (Human)
Description:
gi_5174617
Residue:
953
  
Inhibitor
Name:
BDBM59522
Synonyms:
3-[(3,4-difluorophenyl)sulfonylamino]-N-(6-mesyl-1,3-benzothiazol-2-yl)benzamide 3-[[3,4-bis(fluoranyl)phenyl]sulfonylamino]-N-(6-methylsulfonyl-1,3-benzothiazol-2-yl)benzamide SMR000248437 | cid_2361755
Type:
Small organic molecule
Emp. Form.:
C21H15F2N3O5S3
Mol. Mass.:
523.553
SMILES:
CS(=O)(=O)c1ccc2nc(NC(=O)c3cccc(NS(=O)(=O)c4ccc(F)c(F)c4)c3)sc2c1
: