Target
Nucleotide-binding oligomerization domain-containing protein 1
Ligand
BDBM54293
Substrate
Meas. Tech.
uHTS luminescence assay for the identification of compounds that inhibit NOD1
EC50
4330±n/a nM
Citation
 PubChem, PC uHTS luminescence assay for the identification of compounds that inhibit NOD1 PubChem Bioassay (2010)[AID] 
Target
Name:
Nucleotide-binding oligomerization domain-containing protein 1
Synonyms:
CARD4 NOD1_HUMAN | nucleotide-binding oligomerization domain containing 1
Type:
Enzyme Catalytic Domain
Mol. Mass.:
107699.03
Organism:
Homo sapiens (Human)
Description:
gi_5174617
Residue:
953
  
Inhibitor
Name:
BDBM54293
Synonyms:
(5Z)-5-(4-hydroxy-3-nitro-benzylidene)-3-(3-nitrobenzyl)thiazolidine-2,4-quinone (5Z)-5-[(4-hydroxy-3-nitrophenyl)methylidene]-3-[(3-nitrophenyl)methyl]-1,3-thiazolidine-2,4-dione 5-(4-hydroxy-3-nitrobenzylidene)-3-(3-nitrobenzyl)-1,3-thiazolidine-2,4-dione SMR000231567 | cid_1721822
Type:
Small organic molecule
Emp. Form.:
C17H11N3O7S
Mol. Mass.:
401.35
SMILES:
Oc1ccc(\C=C2/SC(=O)N(Cc3cccc(c3)[N+]([O-])=O)C2=O)cc1[N+]([O-])=O
: