Target
M17 leucyl aminopeptidase
Ligand
BDBM59907
Substrate
Meas. Tech.
Inhibitors of Plasmodium falciparum M17- Family Leucine Aminopeptidase (M17LAP)
IC50
1530±n/a nM
Citation
 PubChem, PC Inhibitors of Plasmodium falciparum M17- Family Leucine Aminopeptidase (M17LAP) PubChem Bioassay (2009)[AID] 
Target
Name:
M17 leucyl aminopeptidase
Synonyms:
leucine aminopeptidase
Type:
Enzyme Catalytic Domain
Mol. Mass.:
67834.32
Organism:
Plasmodium falciparum 3D7
Description:
gi_124809582
Residue:
605
  
Inhibitor
Name:
BDBM59907
Synonyms:
(4-chlorophenyl)-(1H-1,2,4-triazol-5-yl)amine N-(4-chlorophenyl)-1H-1,2,4-triazol-5-amine cid_2766468
Type:
Small organic molecule
Emp. Form.:
C8H7ClN4
Mol. Mass.:
194.621
SMILES:
Clc1ccc(Nc2nnc[nH]2)cc1
: