Target
M17 leucyl aminopeptidase
Ligand
BDBM60117
Substrate
Meas. Tech.
Inhibitors of Plasmodium falciparum M17- Family Leucine Aminopeptidase (M17LAP)
IC50
1400±n/a nM
Citation
 PubChem, PC Inhibitors of Plasmodium falciparum M17- Family Leucine Aminopeptidase (M17LAP) PubChem Bioassay (2009)[AID] 
Target
Name:
M17 leucyl aminopeptidase
Synonyms:
leucine aminopeptidase
Type:
Enzyme Catalytic Domain
Mol. Mass.:
67834.32
Organism:
Plasmodium falciparum 3D7
Description:
gi_124809582
Residue:
605
  
Inhibitor
Name:
BDBM60117
Synonyms:
4-chloranyl-6-[(3-cyano-5,5-dimethyl-4,7-dihydrothieno[2,3-c]pyran-2-yl)carbamoyl]cyclohex-3-ene-1-carboxylic acid 4-chloro-6-[[(3-cyano-5,5-dimethyl-4,7-dihydrothieno[2,3-c]pyran-2-yl)amino]-oxomethyl]-1-cyclohex-3-enecarboxylic acid SMR000277854 | cid_2921226
Type:
Small organic molecule
Emp. Form.:
C18H19ClN2O4S
Mol. Mass.:
394.872
SMILES:
CC1(C)Cc2c(CO1)sc(NC(=O)C1CC(Cl)=CCC1C(O)=O)c2C#N
: