Target
M17 leucyl aminopeptidase
Ligand
BDBM60127
Substrate
Meas. Tech.
Inhibitors of Plasmodium falciparum M17- Family Leucine Aminopeptidase (M17LAP)
IC50
1000±n/a nM
Citation
 PubChem, PC Inhibitors of Plasmodium falciparum M17- Family Leucine Aminopeptidase (M17LAP) PubChem Bioassay (2009)[AID] 
Target
Name:
M17 leucyl aminopeptidase
Synonyms:
leucine aminopeptidase
Type:
Enzyme Catalytic Domain
Mol. Mass.:
67834.32
Organism:
Plasmodium falciparum 3D7
Description:
gi_124809582
Residue:
605
  
Inhibitor
Name:
BDBM60127
Synonyms:
4-chloranyl-6-[(3-cyano-4,5,6,7-tetrahydro-1-benzothiophen-2-yl)carbamoyl]cyclohex-3-ene-1-carboxylic acid 4-chloro-6-[(3-cyano-4,5,6,7-tetrahydrobenzothiophen-2-yl)carbamoyl]cyclohex-3-ene-1-carboxylic acid MLS000716334 cid_3149154
Type:
Small organic molecule
Emp. Form.:
C17H17ClN2O3S
Mol. Mass.:
364.846
SMILES:
OC(=O)C1CC=C(Cl)CC1C(=O)Nc1sc2CCCCc2c1C#N
: