Target
M17 leucyl aminopeptidase
Ligand
BDBM60164
Substrate
Meas. Tech.
Inhibitors of Plasmodium falciparum M17- Family Leucine Aminopeptidase (M17LAP)
IC50
1210±n/a nM
Citation
 PubChem, PC Inhibitors of Plasmodium falciparum M17- Family Leucine Aminopeptidase (M17LAP) PubChem Bioassay (2009)[AID] 
Target
Name:
M17 leucyl aminopeptidase
Synonyms:
leucine aminopeptidase
Type:
Enzyme Catalytic Domain
Mol. Mass.:
67834.32
Organism:
Plasmodium falciparum 3D7
Description:
gi_124809582
Residue:
605
  
Inhibitor
Name:
BDBM60164
Synonyms:
2-(3,5-diketo-2-methyl-thiomorpholin-4-yl)-N-p-phenetyl-acetamide N-(4-ethoxyphenyl)-2-(2-methyl-3,5-dioxo-4-thiomorpholinyl)acetamide N-(4-ethoxyphenyl)-2-[2-methyl-3,5-bis(oxidanylidene)thiomorpholin-4-yl]ethanamide cid_4983381
Type:
Small organic molecule
Emp. Form.:
C15H18N2O4S
Mol. Mass.:
322.379
SMILES:
CCOc1ccc(NC(=O)CN2C(=O)CSC(C)C2=O)cc1
: