Target
Kappa-type opioid receptor
Ligand
BDBM33080
Substrate
Meas. Tech.
uHTS identification of small molecule antagonists of the kappa opioid receptor via a luminescent beta-arrestin assay
IC50
8160±n/a nM
Citation
 PubChem, PC uHTS identification of small molecule antagonists of the kappa opioid receptor via a luminescent beta-arrestin assay PubChem Bioassay (2009)[AID] 
Target
Name:
Kappa-type opioid receptor
Synonyms:
K-OR-1 Kappa-opioid receptor (KOR) Kappa-type opioid receptor (KOR) OPIATE Kappa OPRK1 kappa opioid receptor (KOR)
Type:
G Protein-Coupled Receptor (GPCR)
Mol. Mass.:
42648.76
Organism:
Homo sapiens (Human)
Description:
P41145
Residue:
380
  
Inhibitor
Name:
BDBM33080
Synonyms:
2-[[7-(1,3-benzothiazol-2-ylsulfanyl)-4-nitro-2,1,3-benzoxadiazol-5-yl]amino]ethyl propanoate SMR000131460 propanoic acid 2-[[7-(1,3-benzothiazol-2-ylthio)-4-nitro-2,1,3-benzoxadiazol-5-yl]amino]ethyl ester | propionic acid 2-[[7-(1,3-benzothiazol-2-ylthio)-4-nitro-benzofurazan-5-yl]amino]ethyl ester
Type:
Small organic molecule
Emp. Form.:
C18H15N5O5S2
Mol. Mass.:
445.472
SMILES:
CCC(=O)OCCNc1cc(Sc2nc3ccccc3s2)c2nonc2c1[N+]([O-])=O
: