Target
Plectin
Ligand
BDBM60323
Substrate
Meas. Tech.
uHTS identification of small molecule antagonists of the binding of Siah-1 and a peptide ligand via a fluorescence polarization assay.
IC50
200000±n/a nM
Citation
 PubChem, PC uHTS identification of small molecule antagonists of the binding of Siah-1 and a peptide ligand via a fluorescence polarization assay. PubChem Bioassay (2009)[AID] 
Target
Name:
Plectin
Synonyms:
PLEC PLEC_HUMAN | plectin 1
Type:
Enzyme Catalytic Domain
Mol. Mass.:
531740.96
Organism:
Homo sapiens (Human)
Description:
Q15149
Residue:
4684
  
Inhibitor
Name:
BDBM60323
Synonyms:
(1-phenyl-1,2,3-triazol-4-yl)methyl N-(4-chlorophenyl)carbamate (1-phenyltriazol-4-yl)methyl N-(4-chlorophenyl)carbamate N-(4-chlorophenyl)carbamic acid (1-phenyl-4-triazolyl)methyl ester SMR000333369 | cid_1478612
Type:
Small organic molecule
Emp. Form.:
C16H13ClN4O2
Mol. Mass.:
328.753
SMILES:
Clc1ccc(NC(=O)OCc2cn(nn2)-c2ccccc2)cc1
: