Target
Plectin
Ligand
BDBM54930
Substrate
Meas. Tech.
uHTS identification of small molecule antagonists of the binding of Siah-1 and a peptide ligand via a fluorescence polarization assay.
IC50
17297±n/a nM
Citation
 PubChem, PC uHTS identification of small molecule antagonists of the binding of Siah-1 and a peptide ligand via a fluorescence polarization assay. PubChem Bioassay (2009)[AID] 
Target
Name:
Plectin
Synonyms:
PLEC PLEC_HUMAN | plectin 1
Type:
Enzyme Catalytic Domain
Mol. Mass.:
531740.96
Organism:
Homo sapiens (Human)
Description:
Q15149
Residue:
4684
  
Inhibitor
Name:
BDBM54930
Synonyms:
(4-{[(8-allyl-2-oxo-2H-chromen-3-yl)carbonyl]amino}phenyl)acetic acid 2-[4-[(2-oxo-8-prop-2-enylchromene-3-carbonyl)amino]phenyl]acetic acid 2-[4-[[oxo-(2-oxo-8-prop-2-enyl-1-benzopyran-3-yl)methyl]amino]phenyl]acetic acid SMR000313565 | cid_1262781
Type:
Small organic molecule
Emp. Form.:
C21H17NO5
Mol. Mass.:
363.3634
SMILES:
OC(=O)Cc1ccc(NC(=O)c2cc3cccc(CC=C)c3oc2=O)cc1
: