Target
Plectin
Ligand
BDBM54936
Substrate
Meas. Tech.
uHTS identification of small molecule antagonists of the binding of Siah-1 and a peptide ligand via a fluorescence polarization assay.
IC50
200000±n/a nM
Citation
 PubChem, PC uHTS identification of small molecule antagonists of the binding of Siah-1 and a peptide ligand via a fluorescence polarization assay. PubChem Bioassay (2009)[AID] 
Target
Name:
Plectin
Synonyms:
PLEC PLEC_HUMAN | plectin 1
Type:
Enzyme Catalytic Domain
Mol. Mass.:
531740.96
Organism:
Homo sapiens (Human)
Description:
Q15149
Residue:
4684
  
Inhibitor
Name:
BDBM54936
Synonyms:
MLS001003216 cid_2391838
Type:
Small organic molecule
Emp. Form.:
C26H19N3O5S
Mol. Mass.:
485.511
SMILES:
OC(=O)c1ccc(C=NNC(=O)c2ccc(CN3c4cccc5cccc(c45)S3(=O)=O)cc2)cc1
: