Target
Plectin
Ligand
BDBM60325
Substrate
Meas. Tech.
uHTS identification of small molecule antagonists of the binding of Siah-1 and a peptide ligand via a fluorescence polarization assay.
IC50
200000±n/a nM
Citation
 PubChem, PC uHTS identification of small molecule antagonists of the binding of Siah-1 and a peptide ligand via a fluorescence polarization assay. PubChem Bioassay (2009)[AID] 
Target
Name:
Plectin
Synonyms:
PLEC PLEC_HUMAN | plectin 1
Type:
Enzyme Catalytic Domain
Mol. Mass.:
531740.96
Organism:
Homo sapiens (Human)
Description:
Q15149
Residue:
4684
  
Inhibitor
Name:
BDBM60325
Synonyms:
(E)-3-(4-fluorophenyl)-N-[[4-[(6-methoxy-4-pyrimidinyl)sulfamoyl]anilino]-sulfanylidenemethyl]-2-propenamide (E)-3-(4-fluorophenyl)-N-[[4-[(6-methoxypyrimidin-4-yl)sulfamoyl]phenyl]thiocarbamoyl]acrylamide MLS000766629 cid_1830592
Type:
Small organic molecule
Emp. Form.:
C21H18FN5O4S2
Mol. Mass.:
487.527
SMILES:
COc1cc(NS(=O)(=O)c2ccc(NC(=S)NC(=O)C=Cc3ccc(F)cc3)cc2)ncn1
: