Target
Plectin
Ligand
BDBM58421
Substrate
Meas. Tech.
uHTS identification of small molecule antagonists of the binding of Siah-1 and a peptide ligand via a fluorescence polarization assay.
IC50
200000±n/a nM
Citation
 PubChem, PC uHTS identification of small molecule antagonists of the binding of Siah-1 and a peptide ligand via a fluorescence polarization assay. PubChem Bioassay (2009)[AID] 
Target
Name:
Plectin
Synonyms:
PLEC PLEC_HUMAN | plectin 1
Type:
Enzyme Catalytic Domain
Mol. Mass.:
531740.96
Organism:
Homo sapiens (Human)
Description:
Q15149
Residue:
4684
  
Inhibitor
Name:
BDBM58421
Synonyms:
(5E)-3-benzyl-5-(3-chloro-4-hydroxy-5-methoxy-benzylidene)-2-thioxo-thiazolidin-4-one (5E)-3-benzyl-5-[(3-chloro-4-hydroxy-5-methoxyphenyl)methylidene]-2-sulfanylidene-1,3-thiazolidin-4-one (5E)-5-[(3-chloro-4-hydroxy-5-methoxyphenyl)methylidene]-3-(phenylmethyl)-2-sulfanylidene-4-thiazolidinone SMR000555724 | cid_1341927
Type:
Small organic molecule
Emp. Form.:
C18H14ClNO3S2
Mol. Mass.:
391.892
SMILES:
COc1cc(\C=C2\SC(=S)N(Cc3ccccc3)C2=O)cc(Cl)c1O
: