Target
Large T antigen
Ligand
BDBM34253
Substrate
Meas. Tech.
Identification of SV40 T antigen inhibitors: A route to novel anti-viral reagents
IC50
12820±n/a nM
Citation
 PubChem, PC Identification of SV40 T antigen inhibitors: A route to novel anti-viral reagents PubChem Bioassay (2010)[AID] 
Target
Name:
Large T antigen
Synonyms:
LT LT_SV40
Type:
Enzyme Catalytic Domain
Mol. Mass.:
81575.54
Organism:
Simian virus 40
Description:
P03070
Residue:
708
  
Inhibitor
Name:
BDBM34253
Synonyms:
2-[2-(3,4-dihydroxyphenyl)-2-oxoethyl]sulfanyl-N-(2,6-dimethylphenyl)acetamide 2-[[2-(3,4-dihydroxyphenyl)-2-keto-ethyl]thio]-N-(2,6-dimethylphenyl)acetamide MLS000036377 cid_660434
Type:
Small organic molecule
Emp. Form.:
C18H19NO4S
Mol. Mass.:
345.413
SMILES:
Cc1cccc(C)c1NC(=O)CSCC(=O)c1ccc(O)c(O)c1
: