Target
Large T antigen
Ligand
BDBM35500
Substrate
Meas. Tech.
Identification of SV40 T antigen inhibitors: A route to novel anti-viral reagents
IC50
18070±n/a nM
Citation
 PubChem, PC Identification of SV40 T antigen inhibitors: A route to novel anti-viral reagents PubChem Bioassay (2010)[AID] 
Target
Name:
Large T antigen
Synonyms:
LT LT_SV40
Type:
Enzyme Catalytic Domain
Mol. Mass.:
81575.54
Organism:
Simian virus 40
Description:
P03070
Residue:
708
  
Inhibitor
Name:
BDBM35500
Synonyms:
2-(4-chlorophenyl)sulfonyl-4,5-dimethyl-3,6-dihydro-1,2-thiazine 1-oxide MLS000048879 cid_794694
Type:
Small organic molecule
Emp. Form.:
C12H14ClNO3S2
Mol. Mass.:
319.827
SMILES:
CC1=C(C)CS(=O)N(C1)S(=O)(=O)c1ccc(Cl)cc1
: