Target
Large T antigen
Ligand
BDBM60373
Substrate
Meas. Tech.
Identification of SV40 T antigen inhibitors: A route to novel anti-viral reagents
IC50
100000±n/a nM
Citation
 PubChem, PC Identification of SV40 T antigen inhibitors: A route to novel anti-viral reagents PubChem Bioassay (2010)[AID] 
Target
Name:
Large T antigen
Synonyms:
LT LT_SV40
Type:
Enzyme Catalytic Domain
Mol. Mass.:
81575.54
Organism:
Simian virus 40
Description:
P03070
Residue:
708
  
Inhibitor
Name:
BDBM60373
Synonyms:
2-amino-4,4-bis(ethylthio)-6-(2,3,4-trimethoxyphenyl)-3-azabicyclo[3.1.0]hex-2-ene-1,5-dicarbonitrile 4-amino-2,2-bis(ethylthio)-6-(2,3,4-trimethoxyphenyl)-3-azabicyclo[3.1.0]hex-3-ene-1,5-dicarbonitrile MLS000085501 cid_3235730
Type:
Small organic molecule
Emp. Form.:
C20H24N4O3S2
Mol. Mass.:
432.56
SMILES:
CCSC1(SCC)N=C(N)C2(C#N)C(c3ccc(OC)c(OC)c3OC)C12C#N
: