Target
Large T antigen
Ligand
BDBM30842
Substrate
Meas. Tech.
Identification of SV40 T antigen inhibitors: A route to novel anti-viral reagents
IC50
33830±n/a nM
Citation
 PubChem, PC Identification of SV40 T antigen inhibitors: A route to novel anti-viral reagents PubChem Bioassay (2010)[AID] 
Target
Name:
Large T antigen
Synonyms:
LT LT_SV40
Type:
Enzyme Catalytic Domain
Mol. Mass.:
81575.54
Organism:
Simian virus 40
Description:
P03070
Residue:
708
  
Inhibitor
Name:
BDBM30842
Synonyms:
(2Z)-7-hydroxy-2-[(4-methylphenyl)imino]-2H-chromene-3-carboxamide 2-(4-methylanilino)-7-oxochromene-3-carboxamide 7-keto-2-(p-toluidino)chromene-3-carboxamide SMR000019267 | cid_3235952
Type:
Small organic molecule
Emp. Form.:
C17H14N2O3
Mol. Mass.:
294.3047
SMILES:
Cc1ccc(Nc2oc3cc(=O)ccc3cc2C(N)=O)cc1
: