Target
Large T antigen
Ligand
BDBM34361
Substrate
Meas. Tech.
Identification of SV40 T antigen inhibitors: A route to novel anti-viral reagents
IC50
33270±n/a nM
Citation
 PubChem, PC Identification of SV40 T antigen inhibitors: A route to novel anti-viral reagents PubChem Bioassay (2010)[AID] 
Target
Name:
Large T antigen
Synonyms:
LT LT_SV40
Type:
Enzyme Catalytic Domain
Mol. Mass.:
81575.54
Organism:
Simian virus 40
Description:
P03070
Residue:
708
  
Inhibitor
Name:
BDBM34361
Synonyms:
2-hydroxy-5-[(2-keto-1,3-benzoxathiol-5-yl)sulfamoyl]benzoic acid 2-hydroxy-5-{[(2-oxo-1,3-benzoxathiol-5-yl)amino]sulfonyl}benzoic acid MLS000043617 cid_3238401
Type:
Small organic molecule
Emp. Form.:
C14H9NO7S2
Mol. Mass.:
367.354
SMILES:
OC(=O)c1cc(ccc1O)S(=O)(=O)Nc1ccc2oc(=O)sc2c1
: