Target
Large T antigen
Ligand
BDBM60375
Substrate
Meas. Tech.
Identification of SV40 T antigen inhibitors: A route to novel anti-viral reagents
IC50
46340±n/a nM
Citation
 PubChem, PC Identification of SV40 T antigen inhibitors: A route to novel anti-viral reagents PubChem Bioassay (2010)[AID] 
Target
Name:
Large T antigen
Synonyms:
LT LT_SV40
Type:
Enzyme Catalytic Domain
Mol. Mass.:
81575.54
Organism:
Simian virus 40
Description:
P03070
Residue:
708
  
Inhibitor
Name:
BDBM60375
Synonyms:
3-[(2-keto-1,3-benzoxathiol-5-yl)sulfamoyl]benzoic acid 3-[(2-oxo-1,3-benzoxathiol-5-yl)sulfamoyl]benzoic acid MLS000090317 cid_3238639
Type:
Small organic molecule
Emp. Form.:
C14H9NO6S2
Mol. Mass.:
351.354
SMILES:
OC(=O)c1cccc(c1)S(=O)(=O)Nc1ccc2oc(=O)sc2c1
: