Target
Large T antigen
Ligand
BDBM60383
Substrate
Meas. Tech.
Identification of SV40 T antigen inhibitors: A route to novel anti-viral reagents
IC50
6660±n/a nM
Citation
 PubChem, PC Identification of SV40 T antigen inhibitors: A route to novel anti-viral reagents PubChem Bioassay (2010)[AID] 
Target
Name:
Large T antigen
Synonyms:
LT LT_SV40
Type:
Enzyme Catalytic Domain
Mol. Mass.:
81575.54
Organism:
Simian virus 40
Description:
P03070
Residue:
708
  
Inhibitor
Name:
BDBM60383
Synonyms:
(2E)-2-[(4-hydroxyanilino)methylene]cyclohexanone (2E)-2-[(4-hydroxyanilino)methylidene]cyclohexan-1-one 2-{[(4-hydroxyphenyl)amino]methylene}cyclohexanone SMR000072714 | cid_890962
Type:
Small organic molecule
Emp. Form.:
C13H15NO2
Mol. Mass.:
217.2637
SMILES:
Oc1ccc(NC=C2CCCCC2=O)cc1
: