Target
Large T antigen
Ligand
BDBM46141
Substrate
Meas. Tech.
Identification of SV40 T antigen inhibitors: A route to novel anti-viral reagents
IC50
76270±n/a nM
Citation
 PubChem, PC Identification of SV40 T antigen inhibitors: A route to novel anti-viral reagents PubChem Bioassay (2010)[AID] 
Target
Name:
Large T antigen
Synonyms:
LT LT_SV40
Type:
Enzyme Catalytic Domain
Mol. Mass.:
81575.54
Organism:
Simian virus 40
Description:
P03070
Residue:
708
  
Inhibitor
Name:
BDBM46141
Synonyms:
1-(2-furanylmethyl)-1,3-diazinane-2,4,6-trione 1-(furan-2-ylmethyl)-1,3-diazinane-2,4,6-trione cid_2269367
Type:
Small organic molecule
Emp. Form.:
C9H8N2O4
Mol. Mass.:
208.1708
SMILES:
O=C1CC(=O)N(Cc2ccco2)C(=O)N1
: