Target
SUMO-activating enzyme subunit 1
Ligand
BDBM61226
Substrate
Meas. Tech.
uHTS HTRF assay for identification of inhibitors of SUMOylation
IC50
5710±n/a nM
Citation
 PubChem, PC uHTS HTRF assay for identification of inhibitors of SUMOylation PubChem Bioassay (2010)[AID] 
Target
Name:
SUMO-activating enzyme subunit 1
Synonyms:
AOS1 SAE1_HUMAN SUMO-activating enzyme subunit 1 (SAE1) UBLE1A
Type:
Enzyme Catalytic Domain
Mol. Mass.:
38440.84
Organism:
Homo sapiens (Human)
Description:
gi_17390638
Residue:
346
  
Inhibitor
Name:
BDBM61226
Synonyms:
3,4-dimethyl-N-[2-oxidanyl-1,3-bis(oxidanylidene)inden-2-yl]benzamide N-(2-hydroxy-1,3-diketo-indan-2-yl)-3,4-dimethyl-benzamide N-(2-hydroxy-1,3-dioxo-2-indenyl)-3,4-dimethylbenzamide SMR000458138 | cid_2810379
Type:
Small organic molecule
Emp. Form.:
C18H15NO4
Mol. Mass.:
309.316
SMILES:
Cc1ccc(cc1C)C(=O)NC1(O)C(=O)c2ccccc2C1=O
: