Target
Eukaryotic translation initiation factor 4H
Ligand
BDBM61268
Substrate
Meas. Tech.
uHTS fluorescence polarization assay for the identification of translation initiation inhibitors (eIF4H)
IC50
82200±n/a nM
Citation
 PubChem, PC uHTS fluorescence polarization assay for the identification of translation initiation inhibitors (eIF4H) PubChem Bioassay (2009)[AID] 
Target
Name:
Eukaryotic translation initiation factor 4H
Synonyms:
EIF4H KIAA0038 WSCR1
Type:
Enzyme Catalytic Domain
Mol. Mass.:
27385.24
Organism:
Homo sapiens (Human)
Description:
Q15056
Residue:
248
  
Inhibitor
Name:
BDBM61268
Synonyms:
1-methyl-4-(4-pyridyl)pyridin-1-ium;iodide 1-methyl-4-pyridin-4-ylpyridin-1-ium;iodide SMR000057824 | cid_38115
Type:
Small organic molecule
Emp. Form.:
C11H11N2
Mol. Mass.:
171.2179
SMILES:
C[n+]1ccc(cc1)-c1ccncc1
: