Target
Eukaryotic translation initiation factor 4H
Ligand
BDBM61277
Substrate
Meas. Tech.
uHTS fluorescence polarization assay for the identification of translation initiation inhibitors (eIF4H)
IC50
34660±n/a nM
Citation
 PubChem, PC uHTS fluorescence polarization assay for the identification of translation initiation inhibitors (eIF4H) PubChem Bioassay (2009)[AID] 
Target
Name:
Eukaryotic translation initiation factor 4H
Synonyms:
EIF4H KIAA0038 WSCR1
Type:
Enzyme Catalytic Domain
Mol. Mass.:
27385.24
Organism:
Homo sapiens (Human)
Description:
Q15056
Residue:
248
  
Inhibitor
Name:
BDBM61277
Synonyms:
4-(2-furanyl)-6-methyl-2-oxo-3,4-dihydro-1H-pyrimidine-5-carboxylic acid propan-2-yl ester 4-Furan-2-yl-6-methyl-2-oxo-1,2,3,4-tetrahydro-pyrimidine-5-carboxylic acid isopropyl ester SMR000120838 propan-2-yl 4-(furan-2-yl)-6-methyl-2-oxidanylidene-3,4-dihydro-1H-pyrimidine-5-carboxylate | propan-2-yl 4-(furan-2-yl)-6-methyl-2-oxo-3,4-dihydro-1H-pyrimidine-5-carboxylate
Type:
Small organic molecule
Emp. Form.:
C13H16N2O4
Mol. Mass.:
264.2771
SMILES:
CC(C)OC(=O)C1C(NC(=O)N=C1C)c1ccco1
: