Target
Eukaryotic translation initiation factor 4H
Ligand
BDBM61292
Substrate
Meas. Tech.
uHTS fluorescence polarization assay for the identification of translation initiation inhibitors (eIF4H)
IC50
5705±n/a nM
Citation
 PubChem, PC uHTS fluorescence polarization assay for the identification of translation initiation inhibitors (eIF4H) PubChem Bioassay (2009)[AID] 
Target
Name:
Eukaryotic translation initiation factor 4H
Synonyms:
EIF4H KIAA0038 WSCR1
Type:
Enzyme Catalytic Domain
Mol. Mass.:
27385.24
Organism:
Homo sapiens (Human)
Description:
Q15056
Residue:
248
  
Inhibitor
Name:
BDBM61292
Synonyms:
1-(3,4-dichlorophenyl)-3-[(1,2-dimethyl-5-indolyl)methyl]urea MLS000529857 cid_5159269
Type:
Small organic molecule
Emp. Form.:
C18H17Cl2N3O
Mol. Mass.:
362.253
SMILES:
Cc1cc2cc(CNC(=O)Nc3ccc(Cl)c(Cl)c3)ccc2n1C
: