Target
Eukaryotic translation initiation factor 4H
Ligand
BDBM61320
Substrate
Meas. Tech.
uHTS fluorescence polarization assay for the identification of translation initiation inhibitors (eIF4H)
IC50
36695±n/a nM
Citation
 PubChem, PC uHTS fluorescence polarization assay for the identification of translation initiation inhibitors (eIF4H) PubChem Bioassay (2009)[AID] 
Target
Name:
Eukaryotic translation initiation factor 4H
Synonyms:
EIF4H KIAA0038 WSCR1
Type:
Enzyme Catalytic Domain
Mol. Mass.:
27385.24
Organism:
Homo sapiens (Human)
Description:
Q15056
Residue:
248
  
Inhibitor
Name:
BDBM61320
Synonyms:
(E)-N-[[4-(acetylcarbamothioylamino)phenyl]carbamothioyl]-3-(furan-2-yl)prop-2-enamide (E)-N-[[4-(ethanoylcarbamothioylamino)phenyl]carbamothioyl]-3-(furan-2-yl)prop-2-enamide 1-[4-(3-Acetyl-thioureido)-phenyl]-3-((E)-3-furan-2-yl-acryloyl)-thiourea SMR000434485 | cid_1971610
Type:
Small organic molecule
Emp. Form.:
C17H16N4O3S2
Mol. Mass.:
388.464
SMILES:
CC(=O)NC(=S)Nc1ccc(NC(=S)NC(=O)C=Cc2ccco2)cc1
: