Target
Eukaryotic translation initiation factor 4H
Ligand
BDBM61338
Substrate
Meas. Tech.
uHTS fluorescence polarization assay for the identification of translation initiation inhibitors (eIF4H)
IC50
48285±n/a nM
Citation
 PubChem, PC uHTS fluorescence polarization assay for the identification of translation initiation inhibitors (eIF4H) PubChem Bioassay (2009)[AID] 
Target
Name:
Eukaryotic translation initiation factor 4H
Synonyms:
EIF4H KIAA0038 WSCR1
Type:
Enzyme Catalytic Domain
Mol. Mass.:
27385.24
Organism:
Homo sapiens (Human)
Description:
Q15056
Residue:
248
  
Inhibitor
Name:
BDBM61338
Synonyms:
3-(4-phenoxy-1-pyridin-1-iumyl)-1-propanesulfonate MLS001211748 The compound has not trivial name. | cid_3108930
Type:
Small organic molecule
Emp. Form.:
C14H15NO4S
Mol. Mass.:
293.338
SMILES:
[O-]S(=O)(=O)CCC[n+]1ccc(Oc2ccccc2)cc1
: