Target
Eukaryotic translation initiation factor 4H
Ligand
BDBM61382
Substrate
Meas. Tech.
uHTS fluorescence polarization assay for the identification of translation initiation inhibitors (eIF4H)
IC50
100000±n/a nM
Citation
 PubChem, PC uHTS fluorescence polarization assay for the identification of translation initiation inhibitors (eIF4H) PubChem Bioassay (2009)[AID] 
Target
Name:
Eukaryotic translation initiation factor 4H
Synonyms:
EIF4H KIAA0038 WSCR1
Type:
Enzyme Catalytic Domain
Mol. Mass.:
27385.24
Organism:
Homo sapiens (Human)
Description:
Q15056
Residue:
248
  
Inhibitor
Name:
BDBM61382
Synonyms:
(4S)-1-ethyl-6-methyl-2-(prop-2-enylamino)-4-[3-(trifluoromethyl)phenyl]-4H-pyrimidine-5-carboxylic acid methyl ester MLS000829960 cid_24793383 | methyl (4S)-1-ethyl-6-methyl-2-(prop-2-enylamino)-4-[3-(trifluoromethyl)phenyl]-4H-pyrimidine-5-carboxylate
Type:
Small organic molecule
Emp. Form.:
C19H22F3N3O2
Mol. Mass.:
381.3921
SMILES:
CCN1C(C)=C([C@@H](N=C1NCC=C)c1cccc(c1)C(F)(F)F)C(=O)OC
: