Target
Polyadenylate-binding protein 1
Ligand
BDBM61289
Substrate
Meas. Tech.
uHTS fluorescence polarization assay for the identification of translation initiation inhibitors (PABP)
IC50
100000±n/a nM
Citation
 PubChem, PC uHTS fluorescence polarization assay for the identification of translation initiation inhibitors (PABP) PubChem Bioassay (2009)[AID] 
Target
Name:
Polyadenylate-binding protein 1
Synonyms:
PAB1 PABP1 PABPC1 poly(A) binding protein, cytoplasmic 1 | polyadenylate-binding protein 1
Type:
Enzyme Catalytic Domain
Mol. Mass.:
70694.26
Organism:
Homo sapiens (Human)
Description:
gi_46367787
Residue:
636
  
Inhibitor
Name:
BDBM61289
Synonyms:
2-(2-methylphenyl)sulfanyl-1-[4-[5-(trifluoromethyl)pyridin-2-yl]piperazin-1-yl]ethanone 2-[(2-methylphenyl)thio]-1-[4-[5-(trifluoromethyl)-2-pyridinyl]-1-piperazinyl]ethanone SMR000253943 | cid_4878854
Type:
Small organic molecule
Emp. Form.:
C19H20F3N3OS
Mol. Mass.:
395.442
SMILES:
Cc1ccccc1SCC(=O)N1CCN(CC1)c1ccc(cn1)C(F)(F)F
: