Target
Polyadenylate-binding protein 1
Ligand
BDBM61292
Substrate
Meas. Tech.
uHTS fluorescence polarization assay for the identification of translation initiation inhibitors (PABP)
IC50
4535±n/a nM
Citation
 PubChem, PC uHTS fluorescence polarization assay for the identification of translation initiation inhibitors (PABP) PubChem Bioassay (2009)[AID] 
Target
Name:
Polyadenylate-binding protein 1
Synonyms:
PAB1 PABP1 PABPC1 poly(A) binding protein, cytoplasmic 1 | polyadenylate-binding protein 1
Type:
Enzyme Catalytic Domain
Mol. Mass.:
70694.26
Organism:
Homo sapiens (Human)
Description:
gi_46367787
Residue:
636
  
Inhibitor
Name:
BDBM61292
Synonyms:
1-(3,4-dichlorophenyl)-3-[(1,2-dimethyl-5-indolyl)methyl]urea MLS000529857 cid_5159269
Type:
Small organic molecule
Emp. Form.:
C18H17Cl2N3O
Mol. Mass.:
362.253
SMILES:
Cc1cc2cc(CNC(=O)Nc3ccc(Cl)c(Cl)c3)ccc2n1C
: