Target
Polyadenylate-binding protein 1
Ligand
BDBM61303
Substrate
Meas. Tech.
uHTS fluorescence polarization assay for the identification of translation initiation inhibitors (PABP)
IC50
26740±n/a nM
Citation
 PubChem, PC uHTS fluorescence polarization assay for the identification of translation initiation inhibitors (PABP) PubChem Bioassay (2009)[AID] 
Target
Name:
Polyadenylate-binding protein 1
Synonyms:
PAB1 PABP1 PABPC1 poly(A) binding protein, cytoplasmic 1 | polyadenylate-binding protein 1
Type:
Enzyme Catalytic Domain
Mol. Mass.:
70694.26
Organism:
Homo sapiens (Human)
Description:
gi_46367787
Residue:
636
  
Inhibitor
Name:
BDBM61303
Synonyms:
4-(4-chlorophenyl)-4-keto-butyric acid [2-(2-furfurylamino)-2-keto-ethyl] ester MLS001005762 [2-(furan-2-ylmethylamino)-2-oxidanylidene-ethyl] 4-(4-chlorophenyl)-4-oxidanylidene-butanoate cid_2337974
Type:
Small organic molecule
Emp. Form.:
C17H16ClNO5
Mol. Mass.:
349.766
SMILES:
Clc1ccc(cc1)C(=O)CCC(=O)OCC(=O)NCc1ccco1
: