Target
Polyadenylate-binding protein 1
Ligand
BDBM50578
Substrate
Meas. Tech.
uHTS fluorescence polarization assay for the identification of translation initiation inhibitors (PABP)
IC50
69430±n/a nM
Citation
 PubChem, PC uHTS fluorescence polarization assay for the identification of translation initiation inhibitors (PABP) PubChem Bioassay (2009)[AID] 
Target
Name:
Polyadenylate-binding protein 1
Synonyms:
PAB1 PABP1 PABPC1 poly(A) binding protein, cytoplasmic 1 | polyadenylate-binding protein 1
Type:
Enzyme Catalytic Domain
Mol. Mass.:
70694.26
Organism:
Homo sapiens (Human)
Description:
gi_46367787
Residue:
636
  
Inhibitor
Name:
BDBM50578
Synonyms:
3-[6-(hydroxymethyl)-3,4,5-tris(oxidanyl)oxan-2-yl]oxy-5-phenyl-pentanoic acid 5-phenyl-3-[3,4,5-trihydroxy-6-(hydroxymethyl)oxan-2-yl]oxypentanoic acid MLS000877001 cid_16681750
Type:
Small organic molecule
Emp. Form.:
C17H24O8
Mol. Mass.:
356.3677
SMILES:
OCC1OC(OC(CCc2ccccc2)CC(O)=O)C(O)C(O)C1O
: