Target
Polyadenylate-binding protein 1
Ligand
BDBM61325
Substrate
Meas. Tech.
uHTS fluorescence polarization assay for the identification of translation initiation inhibitors (PABP)
IC50
8960±n/a nM
Citation
 PubChem, PC uHTS fluorescence polarization assay for the identification of translation initiation inhibitors (PABP) PubChem Bioassay (2009)[AID] 
Target
Name:
Polyadenylate-binding protein 1
Synonyms:
PAB1 PABP1 PABPC1 poly(A) binding protein, cytoplasmic 1 | polyadenylate-binding protein 1
Type:
Enzyme Catalytic Domain
Mol. Mass.:
70694.26
Organism:
Homo sapiens (Human)
Description:
gi_46367787
Residue:
636
  
Inhibitor
Name:
BDBM61325
Synonyms:
1-N,3-N-bis(2-hydroxy-5-nitrophenyl)benzene-1,3-dicarboxamide N,N'-bis(2-hydroxy-5-nitrophenyl)isophthalamide N1,N3-bis(2-hydroxy-5-nitrophenyl)benzene-1,3-dicarboxamide SMR000495849 | cid_3823676
Type:
Small organic molecule
Emp. Form.:
C20H14N4O8
Mol. Mass.:
438.3472
SMILES:
Oc1ccc(cc1NC(=O)c1cccc(c1)C(=O)Nc1cc(ccc1O)[N+]([O-])=O)[N+]([O-])=O
: