Target
G-protein coupled receptor 35
Ligand
BDBM61615
Substrate
Meas. Tech.
Image-Based HTS for Selective Antagonists of GPR35
IC50
4956.042±n/a nM
Citation
 PubChem, PC Image-Based HTS for Selective Antagonists of GPR35 PubChem Bioassay (2010)[AID] 
Target
Name:
G-protein coupled receptor 35
Synonyms:
G protein-coupled receptor 35 GPR35_HUMAN
Type:
Enzyme Catalytic Domain
Mol. Mass.:
34085.57
Organism:
Homo sapiens (Human)
Description:
gi_33695097
Residue:
309
  
Inhibitor
Name:
BDBM61615
Synonyms:
MLS000722217 N-[4-[(E)-3-(2-furyl)acryloyl]phenyl]adamantane-1-carboxamide SMR000235859 | cid_7424594
Type:
Small organic molecule
Emp. Form.:
C24H25NO3
Mol. Mass.:
375.4602
SMILES:
[H]C12CC3([H])CC([H])(C1)CC(C2)(C3)C(=O)Nc1ccc(cc1)C(=O)\C=C\c1ccco1
: