Target
G-protein coupled receptor 35
Ligand
BDBM48876
Substrate
Meas. Tech.
Image-Based HTS for Selective Antagonists of GPR35
IC50
1103.971±n/a nM
Citation
 PubChem, PC Image-Based HTS for Selective Antagonists of GPR35 PubChem Bioassay (2010)[AID] 
Target
Name:
G-protein coupled receptor 35
Synonyms:
G protein-coupled receptor 35 GPR35_HUMAN
Type:
Enzyme Catalytic Domain
Mol. Mass.:
34085.57
Organism:
Homo sapiens (Human)
Description:
gi_33695097
Residue:
309
  
Inhibitor
Name:
BDBM48876
Synonyms:
3-[5-[(Z)-(5-azanylidene-7-oxidanylidene-3-phenyl-[1,3]thiazolo[3,2-a]pyrimidin-6-ylidene)methyl]furan-2-yl]benzoic acid 3-[5-[(Z)-(5-imino-7-oxo-3-phenyl-6-thiazolo[3,2-a]pyrimidinylidene)methyl]-2-furanyl]benzoic acid 3-{5-[(Z)-(5-imino-7-oxo-3-phenyl-5H-[1,3]thiazolo[3,2-a]pyrimidin-6(7H)-ylidene)methyl]-2-furyl}benzoic acid SMR000312940 | cid_16195500
Type:
Small organic molecule
Emp. Form.:
C24H15N3O4S
Mol. Mass.:
441.459
SMILES:
OC(=O)c1cccc(c1)-c1ccc(\C=C2/C(=O)N=C3SC=C(N3C2=N)c2ccccc2)o1
: