Target
Neuropeptide Y receptor type 2
Ligand
BDBM61803
Substrate
Meas. Tech.
Fluorescence-based cell-based high-throughput dose response assay for agonists of NPY-Y2.
EC50
21685±n/a nM
Citation
 PubChem, PC Fluorescence-based cell-based high-throughput dose response assay for agonists of NPY-Y2. PubChem Bioassay (2009)[AID] 
Target
Name:
Neuropeptide Y receptor type 2
Synonyms:
NPY-Y2 NPY2-R NPY2R_HUMAN Y2 receptor | neuropeptide Y receptor Y2
Type:
Enzyme Catalytic Domain
Mol. Mass.:
42734.65
Organism:
Homo sapiens (Human)
Description:
NPY-Y2 NPY2R HUMAN::P49146
Residue:
381
  
Inhibitor
Name:
BDBM61803
Synonyms:
MLS000537020 N-(3,4-dichlorophenyl)-4,4,4-trifluoro-3-hydroxy-3-(trifluoromethyl)butyramide SMR000143657 | cid_2167979
Type:
Small organic molecule
Emp. Form.:
C11H7Cl2F6NO2
Mol. Mass.:
370.075
SMILES:
OC(CC(=O)Nc1ccc(Cl)c(Cl)c1)(C(F)(F)F)C(F)(F)F
: