Target
Neuropeptide Y receptor type 2
Ligand
BDBM47537
Substrate
Meas. Tech.
Fluorescence-based cell-based high-throughput dose response assay for agonists of NPY-Y2.
EC50
25591±n/a nM
Citation
 PubChem, PC Fluorescence-based cell-based high-throughput dose response assay for agonists of NPY-Y2. PubChem Bioassay (2009)[AID] 
Target
Name:
Neuropeptide Y receptor type 2
Synonyms:
NPY-Y2 NPY2-R NPY2R_HUMAN Y2 receptor | neuropeptide Y receptor Y2
Type:
Enzyme Catalytic Domain
Mol. Mass.:
42734.65
Organism:
Homo sapiens (Human)
Description:
NPY-Y2 NPY2R HUMAN::P49146
Residue:
381
  
Inhibitor
Name:
BDBM47537
Synonyms:
MLS000707627 N-(2-chloro-5-piperidin-1-ylsulfonylphenyl)-2-[(4-fluorophenyl)sulfonylamino]benzamide N-[2-chloro-5-(1-piperidinylsulfonyl)phenyl]-2-[(4-fluorophenyl)sulfonylamino]benzamide cid_3431315
Type:
Small organic molecule
Emp. Form.:
C24H23ClFN3O5S2
Mol. Mass.:
552.038
SMILES:
Fc1ccc(cc1)S(=O)(=O)Nc1ccccc1C(=O)Nc1cc(ccc1Cl)S(=O)(=O)N1CCCCC1
: