Target
Neuropeptide Y receptor type 2
Ligand
BDBM61841
Substrate
Meas. Tech.
Fluorescence-based cell-based high-throughput dose response assay for agonists of NPY-Y2.
EC50
>35430±n/a nM
Citation
 PubChem, PC Fluorescence-based cell-based high-throughput dose response assay for agonists of NPY-Y2. PubChem Bioassay (2009)[AID] 
Target
Name:
Neuropeptide Y receptor type 2
Synonyms:
NPY-Y2 NPY2-R NPY2R_HUMAN Y2 receptor | neuropeptide Y receptor Y2
Type:
Enzyme Catalytic Domain
Mol. Mass.:
42734.65
Organism:
Homo sapiens (Human)
Description:
NPY-Y2 NPY2R HUMAN::P49146
Residue:
381
  
Inhibitor
Name:
BDBM61841
Synonyms:
(Z)-3-(1-Acetyl-1H-indol-3-yl)-2-nitro-acrylic acid methyl ester (Z)-3-(1-acetylindol-3-yl)-2-nitro-acrylic acid methyl ester SMR000426886 methyl (Z)-3-(1-acetylindol-3-yl)-2-nitroprop-2-enoate | methyl (Z)-3-(1-ethanoylindol-3-yl)-2-nitro-prop-2-enoate
Type:
Small organic molecule
Emp. Form.:
C14H12N2O5
Mol. Mass.:
288.2555
SMILES:
COC(=O)C(=C\c1cn(C(C)=O)c2ccccc12)\[N+]([O-])=O
: