Target
Neuropeptide Y receptor type 2
Ligand
BDBM58070
Substrate
Meas. Tech.
Fluorescence-based cell-based high-throughput dose response assay for agonists of NPY-Y2.
EC50
>35430±n/a nM
Citation
 PubChem, PC Fluorescence-based cell-based high-throughput dose response assay for agonists of NPY-Y2. PubChem Bioassay (2009)[AID] 
Target
Name:
Neuropeptide Y receptor type 2
Synonyms:
NPY-Y2 NPY2-R NPY2R_HUMAN Y2 receptor | neuropeptide Y receptor Y2
Type:
Enzyme Catalytic Domain
Mol. Mass.:
42734.65
Organism:
Homo sapiens (Human)
Description:
NPY-Y2 NPY2R HUMAN::P49146
Residue:
381
  
Inhibitor
Name:
BDBM58070
Synonyms:
2-[(E)-[3-(3-methoxypropyl)-4-oxidanylidene-2-sulfanylidene-1,3-thiazolidin-5-ylidene]methyl]-5-[(4-methylphenyl)amino]-1,3-oxazole-4-carbonitrile 2-[(E)-[3-(3-methoxypropyl)-4-oxo-2-sulfanylidene-5-thiazolidinylidene]methyl]-5-(4-methylanilino)-4-oxazolecarbonitrile 2-[3-(3-Methoxy-propyl)-4-oxo-2-thioxo-thiazolidin-(5E)-ylidenemethyl]-5-p-tolylamino-oxazole-4-carbon itrile SMR000436724 | cid_2026614
Type:
Small organic molecule
Emp. Form.:
C19H18N4O3S2
Mol. Mass.:
414.501
SMILES:
COCCCN1C(=S)S\C(=C\c2nc(C#N)c(Nc3ccc(C)cc3)o2)C1=O
: