Target
Neuropeptide Y receptor type 1
Ligand
BDBM61802
Substrate
Meas. Tech.
Fluorescence-based counterscreen for agonists of NPY-Y2: cell-based high-throughput dose response assay for agonists of NPY-Y1.
EC50
26411±n/a nM
Citation
 PubChem, PC Fluorescence-based counterscreen for agonists of NPY-Y2: cell-based high-throughput dose response assay for agonists of NPY-Y1. PubChem Bioassay (2009)[AID] 
Target
Name:
Neuropeptide Y receptor type 1
Synonyms:
NPY-Y1 NPY1R NPYR neuropeptide Y receptor Y1
Type:
Enzyme Catalytic Domain
Mol. Mass.:
44399.07
Organism:
Homo sapiens (Human)
Description:
NPY-Y1 NPY1R HUMAN::P25929
Residue:
384
  
Inhibitor
Name:
BDBM61802
Synonyms:
4-[[2-[[5-[1-[(2-chlorobenzoyl)amino]ethyl]-4-methyl-1,2,4-triazol-3-yl]thio]acetyl]amino]benzoic acid methyl ester MLS000534916 cid_2945839 methyl 4-[2-[[5-[1-[(2-chlorophenyl)carbonylamino]ethyl]-4-methyl-1,2,4-triazol-3-yl]sulfanyl]ethanoylamino]benzoate | methyl 4-[[2-[[5-[1-[(2-chlorobenzoyl)amino]ethyl]-4-methyl-1,2,4-triazol-3-yl]sulfanyl]acetyl]amino]benzoate
Type:
Small organic molecule
Emp. Form.:
C22H22ClN5O4S
Mol. Mass.:
487.959
SMILES:
COC(=O)c1ccc(NC(=O)CSc2nnc(C(C)NC(=O)c3ccccc3Cl)n2C)cc1
: