Target
Procathepsin L
Ligand
BDBM59684
Substrate
Meas. Tech.
Counterscreen for inhibitors of M1 and M17 aminopeptidases: QFRET-based biochemical high throughput dose response assay for inhibitors of the Cathepsin L proteinase (CTSL1).
IC50
>59642±n/a nM
Citation
 PubChem, PC Counterscreen for inhibitors of M1 and M17 aminopeptidases: QFRET-based biochemical high throughput dose response assay for inhibitors of the Cathepsin L proteinase (CTSL1). PubChem Bioassay (2009)[AID] 
Target
Name:
Procathepsin L
Synonyms:
CATL1_HUMAN CTSL CTSL1 Cathepsin L Cathepsin L1 heavy chain MEP cathepsin L preproprotein
Type:
Enzyme
Mol. Mass.:
37557.19
Organism:
Homo sapiens (Human)
Description:
Purchased from Calbiochem (San Diego, CA).
Residue:
333
  
Inhibitor
Name:
BDBM59684
Synonyms:
2-[(4-keto-6-methyl-5H-pyrimidin-2-yl)thio]-N-(4-methoxyphenyl)acetamide N-(4-methoxyphenyl)-2-[(4-methyl-6-oxidanylidene-5H-pyrimidin-2-yl)sulfanyl]ethanamide N-(4-methoxyphenyl)-2-[(4-methyl-6-oxo-5H-pyrimidin-2-yl)thio]acetamide SMR000024077 | cid_3244210
Type:
Small organic molecule
Emp. Form.:
C14H15N3O3S
Mol. Mass.:
305.352
SMILES:
COc1ccc(NC(=O)CSc2nc(C)cc(=O)[nH]2)cc1
: