Target
Procathepsin L
Ligand
BDBM60008
Substrate
Meas. Tech.
Counterscreen for inhibitors of M1 and M17 aminopeptidases: QFRET-based biochemical high throughput dose response assay for inhibitors of the Cathepsin L proteinase (CTSL1).
IC50
>59642±n/a nM
Citation
 PubChem, PC Counterscreen for inhibitors of M1 and M17 aminopeptidases: QFRET-based biochemical high throughput dose response assay for inhibitors of the Cathepsin L proteinase (CTSL1). PubChem Bioassay (2009)[AID] 
Target
Name:
Procathepsin L
Synonyms:
CATL1_HUMAN CTSL CTSL1 Cathepsin L Cathepsin L1 heavy chain MEP cathepsin L preproprotein
Type:
Enzyme
Mol. Mass.:
37557.19
Organism:
Homo sapiens (Human)
Description:
Purchased from Calbiochem (San Diego, CA).
Residue:
333
  
Inhibitor
Name:
BDBM60008
Synonyms:
6-[[4-(2-methylphenoxy)anilino]-oxomethyl]-1-cyclohex-3-enecarboxylic acid 6-{[4-(2-methylphenoxy)anilino]carbonyl}-3-cyclohexene-1-carboxylic acid SMR000231130 | cid_3470154
Type:
Small organic molecule
Emp. Form.:
C21H21NO4
Mol. Mass.:
351.3957
SMILES:
Cc1ccccc1Oc1ccc(NC(=O)C2CC=CCC2C(O)=O)cc1
: