Target
Procathepsin L
Ligand
BDBM60055
Substrate
Meas. Tech.
Counterscreen for inhibitors of M1 and M17 aminopeptidases: QFRET-based biochemical high throughput dose response assay for inhibitors of the Cathepsin L proteinase (CTSL1).
IC50
>59642±n/a nM
Citation
 PubChem, PC Counterscreen for inhibitors of M1 and M17 aminopeptidases: QFRET-based biochemical high throughput dose response assay for inhibitors of the Cathepsin L proteinase (CTSL1). PubChem Bioassay (2009)[AID] 
Target
Name:
Procathepsin L
Synonyms:
CATL1_HUMAN CTSL CTSL1 Cathepsin L Cathepsin L1 heavy chain MEP cathepsin L preproprotein
Type:
Enzyme
Mol. Mass.:
37557.19
Organism:
Homo sapiens (Human)
Description:
Purchased from Calbiochem (San Diego, CA).
Residue:
333
  
Inhibitor
Name:
BDBM60055
Synonyms:
6-({[3-(methoxycarbonyl)-4-(4-methylphenyl)-2-thienyl]amino}carbonyl)-3-cyclohexene-1-carboxylic acid 6-[[3-methoxycarbonyl-4-(4-methylphenyl)thiophen-2-yl]carbamoyl]cyclohex-3-ene-1-carboxylic acid MLS000704820 cid_4066105
Type:
Small organic molecule
Emp. Form.:
C21H21NO5S
Mol. Mass.:
399.46
SMILES:
COC(=O)c1c(NC(=O)C2CC=CCC2C(O)=O)scc1-c1ccc(C)cc1
: