Target
Induced myeloid leukemia cell differentiation protein Mcl-1
Ligand
BDBM61850
Substrate
Meas. Tech.
Fluorescence polarization-based biochemical high throughput dose response assay for inhibitors of myeloid cell leukemia sequence 1 (MCL1) interactions with BIM-BH3 peptide.
IC50
>108803±n/a nM
Citation
 PubChem, PC Fluorescence polarization-based biochemical high throughput dose response assay for inhibitors of myeloid cell leukemia sequence 1 (MCL1) interactions with BIM-BH3 peptide. PubChem Bioassay (2009)[AID] 
Target
Name:
Induced myeloid leukemia cell differentiation protein Mcl-1
Synonyms:
BCL2L3 Bcl-2-like protein 3 (Mcl-1) Bcl2-L-3 MCL1 Mcl-1 Myeloid cell leukemia sequence 1 (BCL2-related) | mcl1/EAT
Type:
Membrane; Single-pass membrane protein
Mol. Mass.:
37332.87
Organism:
Homo sapiens (Human)
Description:
Q07820
Residue:
350
  
Inhibitor
Name:
BDBM61850
Synonyms:
MLS000096569 [2-(3-chlorophenyl)-5-(2-furanyl)-3-pyrazolyl]-(1-piperidinyl)methanone [2-(3-chlorophenyl)-5-(furan-2-yl)pyrazol-3-yl]-piperidin-1-yl-methanone cid_1053503
Type:
Small organic molecule
Emp. Form.:
C19H18ClN3O2
Mol. Mass.:
355.818
SMILES:
Clc1cccc(c1)-n1nc(cc1C(=O)N1CCCCC1)-c1ccco1
: