Target
Induced myeloid leukemia cell differentiation protein Mcl-1
Ligand
BDBM61899
Substrate
Meas. Tech.
Fluorescence polarization-based biochemical high throughput dose response assay for inhibitors of myeloid cell leukemia sequence 1 (MCL1) interactions with BIM-BH3 peptide.
IC50
15656±n/a nM
Citation
 PubChem, PC Fluorescence polarization-based biochemical high throughput dose response assay for inhibitors of myeloid cell leukemia sequence 1 (MCL1) interactions with BIM-BH3 peptide. PubChem Bioassay (2009)[AID] 
Target
Name:
Induced myeloid leukemia cell differentiation protein Mcl-1
Synonyms:
BCL2L3 Bcl-2-like protein 3 (Mcl-1) Bcl2-L-3 MCL1 Mcl-1 Myeloid cell leukemia sequence 1 (BCL2-related) | mcl1/EAT
Type:
Membrane; Single-pass membrane protein
Mol. Mass.:
37332.87
Organism:
Homo sapiens (Human)
Description:
Q07820
Residue:
350
  
Inhibitor
Name:
BDBM61899
Synonyms:
2-(2-methylphenoxy)acetic acid [2-[(3,5-dichloro-4-methyl-2-pyridinyl)amino]-2-oxoethyl] ester MLS002159502 [2-[(3,5-dichloro-4-methylpyridin-2-yl)amino]-2-oxoethyl] 2-(2-methylphenoxy)acetate cid_8100349
Type:
Small organic molecule
Emp. Form.:
C17H16Cl2N2O4
Mol. Mass.:
383.226
SMILES:
Cc1ccccc1OCC(=O)OCC(=O)Nc1ncc(Cl)c(C)c1Cl
: