Target
Bcl-2-like protein 1
Ligand
BDBM41073
Substrate
Meas. Tech.
Counterscreen for inhibitors of MCL1: fluorescence polarization-based biochemical high throughput dose response assay for inhibitors of BCL2-related protein, long isoform (BCLXL).
IC50
108803±n/a nM
Citation
 PubChem, PC Counterscreen for inhibitors of MCL1: fluorescence polarization-based biochemical high throughput dose response assay for inhibitors of BCL2-related protein, long isoform (BCLXL). PubChem Bioassay (2009)[AID] 
Target
Name:
Bcl-2-like protein 1
Synonyms:
Anti-apoptotic Bcl-2 protein Apoptosis regulator Bcl-X BCL2-like 1 isoform 1 BCL2L1 Bcl-2-like protein 1 (Bcl-XL) Bcl-xL/Bcl-2-binding component 3 Bcl2-antagonist of cell death (BAD)
Type:
Mitochondrion membrane; Single-pass membrane protein
Mol. Mass.:
26039.60
Organism:
Homo sapiens (Human)
Description:
Residue:
233
  
Inhibitor
Name:
BDBM41073
Synonyms:
MLS000325120 N-[(3-fluorobenzylidene)amino]-2-(2-furyl)cinchoninamide N-[(3-fluorophenyl)methylideneamino]-2-(furan-2-yl)quinoline-4-carboxamide cid_1226384
Type:
Small organic molecule
Emp. Form.:
C21H14FN3O2
Mol. Mass.:
359.3532
SMILES:
Fc1cccc(C=NNC(=O)c2cc(nc3ccccc23)-c2ccco2)c1
: