Target
Bcl-2-like protein 1
Ligand
BDBM29680
Substrate
Meas. Tech.
Counterscreen for inhibitors of MCL1: fluorescence polarization-based biochemical high throughput dose response assay for inhibitors of BCL2-related protein, long isoform (BCLXL).
IC50
108803±n/a nM
Citation
 PubChem, PC Counterscreen for inhibitors of MCL1: fluorescence polarization-based biochemical high throughput dose response assay for inhibitors of BCL2-related protein, long isoform (BCLXL). PubChem Bioassay (2009)[AID] 
Target
Name:
Bcl-2-like protein 1
Synonyms:
Anti-apoptotic Bcl-2 protein Apoptosis regulator Bcl-X BCL2-like 1 isoform 1 BCL2L1 Bcl-2-like protein 1 (Bcl-XL) Bcl-xL/Bcl-2-binding component 3 Bcl2-antagonist of cell death (BAD)
Type:
Mitochondrion membrane; Single-pass membrane protein
Mol. Mass.:
26039.60
Organism:
Homo sapiens (Human)
Description:
Residue:
233
  
Inhibitor
Name:
BDBM29680
Synonyms:
2-[(6,7-dihydroxy-2-keto-chromen-4-yl)methylthio]-3-(3-methoxyphenyl)quinazolin-4-one 2-[(6,7-dihydroxy-2-oxochromen-4-yl)methylsulfanyl]-3-(3-methoxyphenyl)quinazolin-4-one MLS000409303 cid_5691857
Type:
Small organic molecule
Emp. Form.:
C25H18N2O6S
Mol. Mass.:
474.485
SMILES:
COc1cccc(c1)-n1c(SCc2cc(=O)oc3cc(O)c(O)cc23)nc2ccccc2c1=O
: