Target
Bcl-2-like protein 1
Ligand
BDBM60859
Substrate
Meas. Tech.
Counterscreen for inhibitors of MCL1: fluorescence polarization-based biochemical high throughput dose response assay for inhibitors of BCL2-related protein, long isoform (BCLXL).
IC50
108803±n/a nM
Citation
 PubChem, PC Counterscreen for inhibitors of MCL1: fluorescence polarization-based biochemical high throughput dose response assay for inhibitors of BCL2-related protein, long isoform (BCLXL). PubChem Bioassay (2009)[AID] 
Target
Name:
Bcl-2-like protein 1
Synonyms:
Anti-apoptotic Bcl-2 protein Apoptosis regulator Bcl-X BCL2-like 1 isoform 1 BCL2L1 Bcl-2-like protein 1 (Bcl-XL) Bcl-xL/Bcl-2-binding component 3 Bcl2-antagonist of cell death (BAD)
Type:
Mitochondrion membrane; Single-pass membrane protein
Mol. Mass.:
26039.60
Organism:
Homo sapiens (Human)
Description:
Residue:
233
  
Inhibitor
Name:
BDBM60859
Synonyms:
5-[(5-bromanylthiophen-2-yl)methylidene]-2-sulfanylidene-1,3-diazinane-4,6-dione 5-[(5-bromo-2-thiophenyl)methylidene]-2-sulfanylidene-1,3-diazinane-4,6-dione MLS001183477 cid_946090
Type:
Small organic molecule
Emp. Form.:
C9H5BrN2O2S2
Mol. Mass.:
317.182
SMILES:
Brc1ccc(\[#6]=[#6]-2\[#6](=O)-[#7]-[#6](=S)-[#7]-[#6]-2=O)s1
: