Target
Bcl-2-like protein 1
Ligand
BDBM61871
Substrate
Meas. Tech.
Counterscreen for inhibitors of MCL1: fluorescence polarization-based biochemical high throughput dose response assay for inhibitors of BCL2-related protein, long isoform (BCLXL).
IC50
108803±n/a nM
Citation
 PubChem, PC Counterscreen for inhibitors of MCL1: fluorescence polarization-based biochemical high throughput dose response assay for inhibitors of BCL2-related protein, long isoform (BCLXL). PubChem Bioassay (2009)[AID] 
Target
Name:
Bcl-2-like protein 1
Synonyms:
Anti-apoptotic Bcl-2 protein Apoptosis regulator Bcl-X BCL2-like 1 isoform 1 BCL2L1 Bcl-2-like protein 1 (Bcl-XL) Bcl-xL/Bcl-2-binding component 3 Bcl2-antagonist of cell death (BAD)
Type:
Mitochondrion membrane; Single-pass membrane protein
Mol. Mass.:
26039.60
Organism:
Homo sapiens (Human)
Description:
Residue:
233
  
Inhibitor
Name:
BDBM61871
Synonyms:
2-[5-(3,4-dimethylphenyl)-4-keto-thieno[2,3-d]pyrimidin-3-yl]acetonitrile 2-[5-(3,4-dimethylphenyl)-4-oxo-3-thieno[2,3-d]pyrimidinyl]acetonitrile MLS001203989 [5-(3,4-Dimethyl-phenyl)-4-oxo-4H-thieno[2,3-d]pyrimidin-3-yl]-acetonitrile | cid_2792011
Type:
Small organic molecule
Emp. Form.:
C16H13N3OS
Mol. Mass.:
295.359
SMILES:
Cc1ccc(cc1C)-c1csc2ncn(CC#N)c(=O)c12
: