Target
Phosphotransferase
Ligand
BDBM43272
Substrate
Meas. Tech.
Confirmation assay for inhibitors of Trypanosoma brucei hexokinase 1-Analogue-first series
IC50
9608.5±n/a nM
Citation
 PubChem, PC Confirmation assay for inhibitors of Trypanosoma brucei hexokinase 1-Analogue-first series PubChem Bioassay (2010)[AID] 
Target
Name:
Phosphotransferase
Synonyms:
hexokinase
Type:
Enzyme Catalytic Domain
Mol. Mass.:
51160.00
Organism:
Trypanosoma brucei
Description:
gi_70832125
Residue:
471
  
Inhibitor
Name:
BDBM43272
Synonyms:
4-chloranyl-2-[(4-methoxyphenyl)carbonylamino]benzoic acid 4-chloro-2-[(4-methoxybenzoyl)amino]benzoic acid MLS000663391 cid_1254149
Type:
Small organic molecule
Emp. Form.:
C15H12ClNO4
Mol. Mass.:
305.713
SMILES:
COc1ccc(cc1)C(=O)Nc1cc(Cl)ccc1C(O)=O
: